إعـــــــلان

تقليص
لا يوجد إعلان حتى الآن.

مشكلة في تنصيب برنامج Dsniff الرجاء المساعدة الفورية

تقليص
X
 
  • تصفية - فلترة
  • الوقت
  • عرض
إلغاء تحديد الكل
مشاركات جديدة

  • مشكلة في تنصيب برنامج Dsniff الرجاء المساعدة الفورية

    السلام عليكم
    وكل عام وانتم بخير
    وسلام خاص الى مشرفنا الغالي على °وينك عالمسنجر صار مدة ماكو°
    اما بالنسبة الى المشكلة التي واجتني في تنصيب برنامج Dsniff على نظام اﻻوبنتو هي عندما اكملت عملية ./confiure
    وبدأت بعمل ال make ظهرت لي الرسالة التالية في الكماند ﻻين ارجو التوضيح
    كود PHP:
    root@t6trt677r:/home/wesam/Desktop/dsniff-2.3# make 
    gcc --O2 -D_BSD_SOURCE -D_BSD_SOURCE -D__BSD_SOURCE -D__FAVOR_BSD -DHAVE_NET_ETHERNET_H -DDSNIFF_LIBDIR="/usr/local/lib/\" -I.       -I./missing -c ./arpspoof.c 
    ./arpspoof.c: In function 'arp_send': 
    ./arpspoof.c:49: warning: passing argument 1 of 'libnet_get_hwaddr' from incompatible pointer type 
    ./arpspoof.c:49: error: too many arguments to function 'libnet_get_hwaddr' 
    ./arpspoof.c:58: warning: pointer targets in assignment differ in signedness 
    ./arpspoof.c:60: warning: passing argument 6 of 'libnet_build_ethernet' from incompatible pointer type 
    ./arpspoof.c:60: error: too few arguments to function 'libnet_build_ethernet' 
    ./arpspoof.c:64: error: 'ETH_H' undeclared (first use in this function) 
    ./arpspoof.c:64: error: (Each undeclared identifier is reported only once 
    ./arpspoof.c:64: error: for each function it appears in.) 
    ./arpspoof.c:64: error: too few arguments to function 'libnet_build_arp' 
    ./arpspoof.c: In function 'main': 
    ./arpspoof.c:181: warning: assignment makes pointer from integer without a cast 
    make: *** [arpspoof.o] Error 1 

  • #2
    السلام عليكم معقولة 15 واحد دخلو الموضوع وماكو ولا رد واحد وينك مشف القسم وينكم الاعضاء هذا مو عهدي بالمنتدى معقولة يوصل لهالحد؟

    تعليق


    • #3
      حمل المرفقات ثم
      اقراء ملف Readme
      الملفات المرفقة
      SЄČURiTY TЄΛM
      MyBlog

      تعليق


      • #4
        مشكور اخي الغالي
        قرأت ما قلت عليه ونصبت ال libnet بنجاح ولكن المشكله عند عمل make الى libpcap وايضا عملت نفس الشئ بالنسبه لل Dsnaff وايضا make ظهرت المشكلة التالية
        كود:
        [email protected]:/media/hda1/Dsniff/dsniff-2.4# make
        gcc -g -O2 -D_BSD_SOURCE -D_BSD_SOURCE -D__BSD_SOURCE -D__FAVOR_BSD -DHAVE_NET_E THERNET_H -DDSNIFF_LIBDIR=\"/usr/local/lib/\" -I.       -I./missing -c ./missing /dummy.c
        gcc -g -O2 -D_BSD_SOURCE -D_BSD_SOURCE -D__BSD_SOURCE -D__FAVOR_BSD -DHAVE_NET_E THERNET_H -DDSNIFF_LIBDIR=\"/usr/local/lib/\" -I.       -I./missing -c ./missing /strlcpy.c
        gcc -g -O2 -D_BSD_SOURCE -D_BSD_SOURCE -D__BSD_SOURCE -D__FAVOR_BSD -DHAVE_NET_E THERNET_H -DDSNIFF_LIBDIR=\"/usr/local/lib/\" -I.       -I./missing -c ./missing /strlcat.c
        gcc -g -O2 -D_BSD_SOURCE -D_BSD_SOURCE -D__BSD_SOURCE -D__FAVOR_BSD -DHAVE_NET_E THERNET_H -DDSNIFF_LIBDIR=\"/usr/local/lib/\" -I.       -I./missing -c ./missing /md5.c
        ar -cr libmissing.a dummy.o  strlcpy.o strlcat.o md5.o
        ranlib libmissing.a
        gcc -g -O2 -D_BSD_SOURCE -D_BSD_SOURCE -D__BSD_SOURCE -D__FAVOR_BSD -DHAVE_NET_E THERNET_H -DDSNIFF_LIBDIR=\"/usr/local/lib/\" -I.       -I./missing -c ./arpspoo f.c
        ./arpspoof.c: In function 'arp_send':
        ./arpspoof.c:51: warning: passing argument 1 of 'libnet_get_hwaddr' from incompa tible pointer type
        ./arpspoof.c:51: error: too many arguments to function 'libnet_get_hwaddr'
        ./arpspoof.c:60: warning: pointer targets in assignment differ in signedness
        ./arpspoof.c:62: warning: passing argument 6 of 'libnet_build_ethernet' from inc ompatible pointer type
        ./arpspoof.c:62: error: too few arguments to function 'libnet_build_ethernet'
        ./arpspoof.c:66: error: 'ETH_H' undeclared (first use in this function)
        ./arpspoof.c:66: error: (Each undeclared identifier is reported only once
        ./arpspoof.c:66: error: for each function it appears in.)
        ./arpspoof.c:66: error: too few arguments to function 'libnet_build_arp'
        ./arpspoof.c: In function 'main':
        ./arpspoof.c:185: warning: assignment makes pointer from integer without a cast
        make: *** [arpspoof.o] Error 1

        تعليق

        يعمل...
        X