إعـــــــلان

تقليص
لا يوجد إعلان حتى الآن.

أنا مبتدى وأريد تعلم اللينكس قبل إعتماده ليتوافق مع عملي

تقليص
X
 
  • تصفية - فلترة
  • الوقت
  • عرض
إلغاء تحديد الكل
مشاركات جديدة

  • أنا مبتدى وأريد تعلم اللينكس قبل إعتماده ليتوافق مع عملي

    السلام عليكم
    كيفكم إخواني

    أنا عندي ثلث أنواع من أنظمة اللينكس قمت بتحميلها من النت

    أوبنتو إصدار(CD) وكوبنتو إصدار(DVD) ونظام DSLinux

    الأوبنتو الكوبنتو متشابهان


    بس أنا عندي نقطة ضعف بالنسبة للينوكس
    وهي إنه حاليا لا أستطيع إستخدام الجهاز الرئيسي الخاص بي في اللينوكس
    لأني لا أعرف به شيئا حتى الأن

    ونظرا لأنه الجهاز الرئيسي
    أستخدمه في التحكم بلشبكة عندي
    ....
    ما أريده حاليا
    هو إصدار لينكس جيد
    ذو مظهر جيد
    يدعم العربية
    ويدعم الإنترنت

    يعني نظام لينكس كامل

    يعمل على جهاز لابتوب
    بنتيوم 3
    سرعة 800 ميجا هرتز
    رام 128 ميجا
    كارت شاشة 8 ميجا

    حيث أريد إستخدام نظام اللينكس عليه حتى أتمكن منه
    وبعد أن أتمكن منه سأستخدمه على الجهاز الرئيسي

    مع العلم على جهازي الرئيسي نظامين تشغيل
    الفيستا
    والكوبنتو (DVD)

    ولكن لا أستطيع إستخدام الكوبنتو كثيرا

    لأني بحاجة للوندوز حتى أتمكن من التحكم بباقي الأجهزة لدي
    فأنا أملك محل شبكة إنترنت وألعاب

    .......
    بالعربي

    أريد حاليا نظام لينكس
    يعمل على جهازي اللابتوب الذي سبق وذكرت مواصفاته في الموضوع

    أرجو منكم إفادتي بأسرع وقت
    دمتم سالمين

  • #2
    اخي الحبيب


    الموضوع باختصار يرجع لك


    التوزيعات متشابهة والبرامج في الغالب تعمل على جميع التوزيعات ، امسك توزيعة وحل كل المشكلات التي تواجهك فيها ، مثلا انا السوزي تناسبني لانها تتعرف على الوايرلس والصوت وكرت الشاشة بدون تدخل مني فاعجبتني وبقيت عليها ( سبق أن جربت الكبنتو والماندريفا والردهات و الديبيان )


    بخصوص التعود على لنكس ، فقم بتحميل برامج لنكس على الوندوز ، مثل الاوبن اوفس و pidgin للمسنجر و الفاير فوكس كمتصفح .

    في امان الله

    تعليق


    • #3
      اسهل واجدع توزيعة ولم اجد بها مشاكل عتى الان وخفيفة جدا
      ال PCLinuxOS2007

      ميزتها 700ميجابايت
      لايف سي يد فممكن تجربها قبل التثبيت على الاب توب
      واجهتها سهلة تركيب وازالة البرامج وتعريف والتحم بالهارد وير
      ولو خرب النظام اثناء تنزيلك على الجهار برامج غير متوافقة يمكنك النظام من الدخول ررووت واصلاح كل شئ
      او حتى اعادة تنزيل النظام مرة اخرى من على الهارد ديسك بدون اسطوانة له و فى 5 دقائق فقط
      اسرع نظام يمكنك عمل اعادة تنصيب له

      السوزى تريد رامات جامدة 512
      او اعلى
      وبتاخذ وقت طويل فى التنصيب3ساعة لتنزيل الاب ديت اثناءه

      الاوبونتو والكوبنتو ثقيل فى التحميل ==الفرمتة وهو قوى ولكن لم اوفق معه
      المندريفا ممتازة ولكن لابد من التسجيل لتحمل البرامج وخلافة

      ولذا افضل البي سي عنها ووهو متربع على القمة فى التحميل والان ومنذ 6 اشهر
      ما هى افضل الطرق لنشر واستخدام اللينوكس ؟
      ا- أبو عبد الله

      تعليق


      • #4
        أشكركم إخواني على سرعة الرد

        وبارك الله فيكم

        أرجو منكم إعطائي رابط التحمل لأفضل نسخة من برنامج PCLinuxOS2007


        وبارك الله فيكم

        تعليق


        • #5
          أدخل علي هذا الرابط تجد كل ما تحتاجه عن هذه التوزيعة

          بالتوفيق إن شاء الله

          http://www.linuxac.org/forum/showthread.php?t=5319

          تعليق


          • #6
            أشكركم إخواني

            ولكم مني كل تقدير

            بارك الله فيكم

            تعليق


            • #7
              xubuntu

              خفيف و ظريف
              لابد ان نسأل لماذا......
              لابد ان نبحث عن أجوبة.....
              لابد ان تكون متوافقة مع العقل و الواقع.....
              الحمد لله الذي منحنا هذه النعم.

              تعليق


              • #8
                أشكركم إخواني على سرعة الإستجابة

                أنا أخذت برنامج PCLinuxOS2007

                ونصبته على اللاب توب

                بس ضل عندي مشكلة
                وهي مش عارف كيفبدي أعرف كرت الشبكة

                موجود عندي ملف التعريف الخاص به على نظام اللينوكس بنفس إسطوانة التعريف يلي موجودة مع الكرت

                بس ما بعرف كيف بدي أستعمل الملف
                يعني بالوندوز
                تنصيب عادي ولحاله بعرف
                بس باللينوكس ما بعرف

                إسم ملف التعريف لكرت الشبكة على اللينوكس هو
                pcmcia-klm5620-l-v1.0.tgz

                وهو موجود على السي دي كالتالي
                system:/media/hdc/linux

                أرجو منكم المساعدة بأقرب وقت

                تعليق


                • #9
                  يمكنك مراجعة المواضيع لمعرفة كيفية تشغيل ملف فقط أبحث


                  تحياتيـ

                  تعليق


                  • #10
                    أعمل ابديت للنظام

                    و أعمل apply لكل الابديت ونصبها على الجهاز

                    وبعد ذالك اذخل على برنامج الحذف والاضافة=علامة النينجاالدائرة السوداء والحمراء= وشغل البرانامج
                    وبعد ذالك ادخل على برنامج ضبط الاعدادات= علامة الميكانيكى ومفتاح المسمير= و اضبط القطعة المطلوبة

                    فقط حرب هى سهلة
                    وقد بحث على الجهاز عندى فوجدت الاعدادات كما فى الصورة المرفقة
                    الملفات المرفقة
                    ما هى افضل الطرق لنشر واستخدام اللينوكس ؟
                    ا- أبو عبد الله

                    تعليق


                    • #11
                      أشكركم إخواني

                      ولكن كيف أعمل أبديت والكمبيوتر غير متصل بالنت

                      لأنه يتصل بالنت عن طريق كيبل الشبكة

                      أرجو أن تفيدوني

                      تعليق


                      • #12
                        المشاركة الأصلية بواسطة oqapsking مشاهدة المشاركة
                        أشكركم إخواني

                        ولكن كيف أعمل أبديت والكمبيوتر غير متصل بالنت

                        لأنه يتصل بالنت عن طريق كيبل الشبكة

                        أرجو أن تفيدوني
                        لازم تتعب شوية لتتعلم

                        على العموم جرب هنا تضع بيانات اتصالك وان شاء الله تعالى تضبط معك

                        وان لم تنجح فعليك باختيار اعداد اتصال جديد و

                        انظر الصور

                        بالمرفقات

                        الملفات المرفقة
                        ما هى افضل الطرق لنشر واستخدام اللينوكس ؟
                        ا- أبو عبد الله

                        تعليق


                        • #13
                          أخي أررجو منك أن تطيل بالك معي

                          ولكن إتصالي عن طريق راوتر

                          والمشكلة إنه كرت الشبكة غير معرف

                          وبدونه ما في إتصال نت

                          يعني هئيت أنا بعرف النت إذا عرفت الشبكة
                          يعني بس تعريف كرت الشبكة هو المشكلة الحالية

                          وبعدها ببدأ أتعمق أكتر بالنظام

                          تعليق


                          • #14
                            مرحبا

                            روح على
                            ١- control center موجوده على التاسك بار شكلها عامل زي مفك ومفتاح انجليزي

                            اضغط عليها ودخل الباسورد تاعتك
                            وبعدين اختار من اليسار network and internet
                            بعدين اختار من اليمين setup network interface
                            واختار نوع اﻻتصال ازا كايبل اختار ethernet
                            بعدين حدد مكان ملف التعريف وكمل

                            بالتوفيق
                            ما عاش الا المجنون وما مات الا العاقل

                            ما ضحك الا المسطول وما زعل الا الفاهم
                            عيش حياتك جنون بجنون

                            تعليق


                            • #15
                              حاولت فيها منن قبل
                              وحاولت الأن
                              لكنه لا يطلب مني شيء
                              يظهر التالي

                              Ethernet
                              No device can be found for this connection type

                              مع العلم أنا حاولت معه كتير

                              هئيت لما دخلت على لائحة الأجهزة وجدة إسم الكرت دخل قائمة الغير معروف
                              أي أن النظام لم يتعرف عليه بأي حال


                              حاولت إني أنصبه عن طريق القنصل
                              عن كالتالي

                              أولا نسخت ملف التعريف الى المجلد tmp
                              ذهبت للكونسول أي التيرمنال
                              وكتبت التالي

                              كود:
                              cd tmp
                              
                              ls
                              
                              cd pcmcia-klm5620-l-v1.0.tgz
                              حيث أن pcmcia-klm5620-l-v1.0.tgz هو إسم ملف التعريف الذي أخذته من السي دي


                              كتبت الأمر make


                              الأن أصبح ظاهر عندي كالتالي

                              كود:
                              [LEFT][[email protected] pcmcia-klm5620-l-v1.0]$[/LEFT]
                              .

                              وظهر لي التالي

                              كود:
                                pcmcia-klm5620-l-v1.0/     pcmcia-klm5620-l-v1.0.tgz
                              [[email protected] tmp]# cd pcmcia-klm5620-l-v1.0
                              [[email protected] pcmcia-klm5620-l-v1.0]# make
                              gcc -DMODULE -DMODVERSIONS -D__KERNEL__ -DKINGMAX -DKINGMAX_KLM5620_L -c -O6 -I/usr/src/linux -I/usr/src/linux/drivers/net -I/usr/src/pcmcia/include -I. -o _pcnet_cs.o pcnet_cs.c
                              In file included from pcnet_cs.c:31:
                              /usr/include/linux/version.h:2:2: error: #error "======================================================="
                              /usr/include/linux/version.h:3:2: error: #error "You should not include /usr/include/{linux,asm}/ header"
                              /usr/include/linux/version.h:4:2: error: #error "files directly for the compilation of kernel modules."
                              /usr/include/linux/version.h:5:2: error: #error ""
                              /usr/include/linux/version.h:6:2: error: #error "glibc now uses kernel header files from a well-defined"
                              /usr/include/linux/version.h:7:2: error: #error "working kernel version (as recommended by Linus Torvalds)"
                              /usr/include/linux/version.h:8:2: error: #error "These files are glibc internal and may not match the"
                              /usr/include/linux/version.h:9:2: error: #error "currently running kernel. They should only be"
                              /usr/include/linux/version.h:10:2: error: #error "included via other system header files - user space"
                              /usr/include/linux/version.h:11:2: error: #error "programs should not directly include <linux/*.h> or"
                              /usr/include/linux/version.h:12:2: error: #error "<asm/*.h> as well."
                              /usr/include/linux/version.h:13:2: error: #error ""
                              /usr/include/linux/version.h:14:2: error: #error "To build kernel modules please do the following:"
                              /usr/include/linux/version.h:15:2: error: #error ""
                              /usr/include/linux/version.h:16:2: error: #error " o Have the kernel sources installed"
                              /usr/include/linux/version.h:17:2: error: #error ""
                              /usr/include/linux/version.h:18:2: error: #error " o Make sure that the symbolic link"
                              /usr/include/linux/version.h:19:2: error: #error "   /lib/modules/`uname -r`/build exists and points to"
                              /usr/include/linux/version.h:20:2: error: #error "   the matching kernel source directory"
                              /usr/include/linux/version.h:21:2: error: #error ""
                              /usr/include/linux/version.h:22:2: error: #error " o Now copy /boot/vmlinuz.version.h to"
                              /usr/include/linux/version.h:23:2: error: #error "   /lib/modules/`uname -r`/build/include/linux/version.h"
                              /usr/include/linux/version.h:24:2: error: #error ""
                              /usr/include/linux/version.h:25:2: error: #error " o When compiling, make sure to use the following"
                              /usr/include/linux/version.h:26:2: error: #error "   compiler option to use the correct include files:"
                              /usr/include/linux/version.h:27:2: error: #error ""
                              /usr/include/linux/version.h:28:2: error: #error "   -I/lib/modules/`uname -r`/build/include"
                              /usr/include/linux/version.h:29:2: error: #error ""
                              /usr/include/linux/version.h:30:2: error: #error "   instead of"
                              /usr/include/linux/version.h:31:2: error: #error ""
                              /usr/include/linux/version.h:32:2: error: #error "   -I/usr/include/linux"
                              /usr/include/linux/version.h:33:2: error: #error ""
                              /usr/include/linux/version.h:34:2: error: #error "   Please adjust the Makefile accordingly."
                              /usr/include/linux/version.h:35:2: error: #error "======================================================="
                              In file included from /usr/include/asm/processor.h:25,
                                               from /usr/include/asm/thread_info.h:17,
                                               from /usr/include/linux/thread_info.h:21,
                                               from /usr/include/linux/preempt.h:10,
                                               from /usr/include/linux/spinlock.h:52,
                                               from /usr/include/linux/seqlock.h:30,
                                               from /usr/include/linux/time.h:7,
                                               from /usr/include/linux/skbuff.h:20,
                                               from pcnet_cs.c:34:
                              /usr/include/linux/cpumask.h:88: error: expected specifier-qualifier-list before ‘DECLARE_BITMAP’
                              /usr/include/linux/cpumask.h: In function ‘__cpu_set’:
                              /usr/include/linux/cpumask.h:94: error: ‘cpumask_t’ has no member named ‘bits’
                              /usr/include/linux/cpumask.h: In function ‘__cpu_clear’:
                              /usr/include/linux/cpumask.h:100: error: ‘cpumask_t’ has no member named ‘bits’
                              /usr/include/linux/cpumask.h: In function ‘__cpus_setall’:
                              /usr/include/linux/cpumask.h:106: error: ‘cpumask_t’ has no member named ‘bits’
                              /usr/include/linux/cpumask.h: In function ‘__cpus_clear’:
                              /usr/include/linux/cpumask.h:112: error: ‘cpumask_t’ has no member named ‘bits’
                              /usr/include/linux/cpumask.h: In function ‘__cpu_test_and_set’:
                              /usr/include/linux/cpumask.h:121: error: ‘cpumask_t’ has no member named ‘bits’
                              /usr/include/linux/cpumask.h: In function ‘__cpus_and’:
                              /usr/include/linux/cpumask.h:128: error: ‘cpumask_t’ has no member named ‘bits’
                              /usr/include/linux/cpumask.h:128: error: ‘cpumask_t’ has no member named ‘bits’
                              /usr/include/linux/cpumask.h:128: error: ‘cpumask_t’ has no member named ‘bits’
                              /usr/include/linux/cpumask.h: In function ‘__cpus_or’:
                              /usr/include/linux/cpumask.h:135: error: ‘cpumask_t’ has no member named ‘bits’
                              /usr/include/linux/cpumask.h:135: error: ‘cpumask_t’ has no member named ‘bits’
                              /usr/include/linux/cpumask.h:135: error: ‘cpumask_t’ has no member named ‘bits’
                              /usr/include/linux/cpumask.h: In function ‘__cpus_xor’:
                              /usr/include/linux/cpumask.h:142: error: ‘cpumask_t’ has no member named ‘bits’
                              /usr/include/linux/cpumask.h:142: error: ‘cpumask_t’ has no member named ‘bits’
                              /usr/include/linux/cpumask.h:142: error: ‘cpumask_t’ has no member named ‘bits’
                              /usr/include/linux/cpumask.h: In function ‘__cpus_andnot’:
                              /usr/include/linux/cpumask.h:150: error: ‘cpumask_t’ has no member named ‘bits’
                              /usr/include/linux/cpumask.h:150: error: ‘cpumask_t’ has no member named ‘bits’
                              /usr/include/linux/cpumask.h:150: error: ‘cpumask_t’ has no member named ‘bits’
                              /usr/include/linux/cpumask.h: In function ‘__cpus_complement’:
                              /usr/include/linux/cpumask.h:157: error: ‘cpumask_t’ has no member named ‘bits’
                              /usr/include/linux/cpumask.h:157: error: ‘cpumask_t’ has no member named ‘bits’
                              /usr/include/linux/cpumask.h: In function ‘__cpus_equal’:
                              /usr/include/linux/cpumask.h:164: error: ‘cpumask_t’ has no member named ‘bits’
                              /usr/include/linux/cpumask.h:164: error: ‘cpumask_t’ has no member named ‘bits’
                              /usr/include/linux/cpumask.h: In function ‘__cpus_intersects’:
                              /usr/include/linux/cpumask.h:171: error: ‘cpumask_t’ has no member named ‘bits’
                              /usr/include/linux/cpumask.h:171: error: ‘cpumask_t’ has no member named ‘bits’
                              /usr/include/linux/cpumask.h: In function ‘__cpus_subset’:
                              /usr/include/linux/cpumask.h:178: error: ‘cpumask_t’ has no member named ‘bits’
                              /usr/include/linux/cpumask.h:178: error: ‘cpumask_t’ has no member named ‘bits’
                              /usr/include/linux/cpumask.h: In function ‘__cpus_empty’:
                              /usr/include/linux/cpumask.h:184: error: ‘cpumask_t’ has no member named ‘bits’
                              /usr/include/linux/cpumask.h: In function ‘__cpus_full’:
                              /usr/include/linux/cpumask.h:190: error: ‘cpumask_t’ has no member named ‘bits’
                              /usr/include/linux/cpumask.h: In function ‘__cpus_weight’:
                              /usr/include/linux/cpumask.h:196: error: ‘cpumask_t’ has no member named ‘bits’
                              /usr/include/linux/cpumask.h: In function ‘__cpus_shift_right’:
                              /usr/include/linux/cpumask.h:204: error: ‘cpumask_t’ has no member named ‘bits’
                              /usr/include/linux/cpumask.h:204: error: ‘cpumask_t’ has no member named ‘bits’
                              /usr/include/linux/cpumask.h: In function ‘__cpus_shift_left’:
                              /usr/include/linux/cpumask.h:212: error: ‘cpumask_t’ has no member named ‘bits’
                              /usr/include/linux/cpumask.h:212: error: ‘cpumask_t’ has no member named ‘bits’
                              In file included from /usr/include/asm/processor.h:25,
                                               from /usr/include/asm/thread_info.h:17,
                                               from /usr/include/linux/thread_info.h:21,
                                               from /usr/include/linux/preempt.h:10,
                                               from /usr/include/linux/spinlock.h:52,
                                               from /usr/include/linux/seqlock.h:30,
                                               from /usr/include/linux/time.h:7,
                                               from /usr/include/linux/skbuff.h:20,
                                               from pcnet_cs.c:34:
                              /usr/include/linux/cpumask.h:239:5: error: missing binary operator before token "("
                              /usr/include/linux/cpumask.h: In function ‘__cpumask_scnprintf’:
                              /usr/include/linux/cpumask.h:273: error: ‘cpumask_t’ has no member named ‘bits’
                              /usr/include/linux/cpumask.h: In function ‘__cpumask_parse’:
                              /usr/include/linux/cpumask.h:281: error: ‘cpumask_t’ has no member named ‘bits’
                              /usr/include/linux/cpumask.h: In function ‘__cpulist_scnprintf’:
                              /usr/include/linux/cpumask.h:289: error: ‘cpumask_t’ has no member named ‘bits’
                              /usr/include/linux/cpumask.h: In function ‘__cpulist_parse’:
                              /usr/include/linux/cpumask.h:295: error: ‘cpumask_t’ has no member named ‘bits’
                              /usr/include/linux/cpumask.h: In function ‘__cpu_remap’:
                              /usr/include/linux/cpumask.h:303: error: ‘cpumask_t’ has no member named ‘bits’
                              /usr/include/linux/cpumask.h:303: error: ‘cpumask_t’ has no member named ‘bits’
                              /usr/include/linux/cpumask.h: In function ‘__cpus_remap’:
                              /usr/include/linux/cpumask.h:311: error: ‘cpumask_t’ has no member named ‘bits’
                              /usr/include/linux/cpumask.h:311: error: ‘cpumask_t’ has no member named ‘bits’
                              /usr/include/linux/cpumask.h:311: error: ‘cpumask_t’ has no member named ‘bits’
                              /usr/include/linux/cpumask.h:311: error: ‘cpumask_t’ has no member named ‘bits’
                              /usr/include/linux/cpumask.h:314:5: error: missing binary operator before token "("
                              /usr/include/linux/cpumask.h:383:5: error: missing binary operator before token "("
                              In file included from /usr/include/asm/thread_info.h:17,
                                               from /usr/include/linux/thread_info.h:21,
                                               from /usr/include/linux/preempt.h:10,
                                               from /usr/include/linux/spinlock.h:52,
                                               from /usr/include/linux/seqlock.h:30,
                                               from /usr/include/linux/time.h:7,
                                               from /usr/include/linux/skbuff.h:20,
                                               from pcnet_cs.c:34:
                              /usr/include/asm/processor.h: At top level:
                              /usr/include/asm/processor.h:79: error: ‘CONFIG_X86_L1_CACHE_SHIFT’ undeclared here (not in a function)
                              /usr/include/asm/processor.h:79: error: requested alignment is not a constant
                              In file included from /usr/include/linux/sched.h:11,
                                               from /usr/include/linux/mm.h:4,
                                               from /usr/include/linux/skbuff.h:26,
                                               from pcnet_cs.c:34:
                              /usr/include/linux/jiffies.h:33:3: error: #error You lose.
                              /usr/include/linux/jiffies.h:210:31: error: division by zero in #if
                              /usr/include/linux/jiffies.h:210:31: error: division by zero in #if
                              /usr/include/linux/jiffies.h:210:31: error: division by zero in #if
                              /usr/include/linux/jiffies.h:210:31: error: division by zero in #if
                              /usr/include/linux/jiffies.h:210:31: error: division by zero in #if
                              /usr/include/linux/jiffies.h:210:31: error: division by zero in #if
                              /usr/include/linux/jiffies.h:210:31: error: division by zero in #if
                              /usr/include/linux/jiffies.h:210:31: error: division by zero in #if
                              /usr/include/linux/jiffies.h:210:31: error: division by zero in #if
                              /usr/include/linux/jiffies.h:210:31: error: division by zero in #if
                              /usr/include/linux/jiffies.h:210:31: error: division by zero in #if
                              /usr/include/linux/jiffies.h:210:31: error: division by zero in #if
                              /usr/include/linux/jiffies.h:210:31: error: division by zero in #if
                              /usr/include/linux/jiffies.h:210:31: error: division by zero in #if
                              /usr/include/linux/jiffies.h:210:31: error: division by zero in #if
                              /usr/include/linux/jiffies.h:210:31: error: division by zero in #if
                              /usr/include/linux/jiffies.h:254:46: error: division by zero in #if
                              In file included from /usr/include/linux/sched.h:11,
                                               from /usr/include/linux/mm.h:4,
                                               from /usr/include/linux/skbuff.h:26,
                                               from pcnet_cs.c:34:
                              /usr/include/linux/jiffies.h: In function ‘jiffies_to_msecs’:
                              /usr/include/linux/jiffies.h:259: error: ‘CONFIG_HZ’ undeclared (first use in this function)
                              /usr/include/linux/jiffies.h:259: error: (Each undeclared identifier is reported only once
                              /usr/include/linux/jiffies.h:259: error: for each function it appears in.)
                              /usr/include/linux/jiffies.h:265:46: error: division by zero in #if
                              /usr/include/linux/jiffies.h: In function ‘jiffies_to_usecs’:
                              /usr/include/linux/jiffies.h:270: error: ‘CONFIG_HZ’ undeclared (first use in this function)
                              /usr/include/linux/jiffies.h:278:46: error: division by zero in #if
                              /usr/include/linux/jiffies.h: In function ‘msecs_to_jiffies’:
                              /usr/include/linux/jiffies.h:283: error: ‘CONFIG_HZ’ undeclared (first use in this function)
                              /usr/include/linux/jiffies.h:291:46: error: division by zero in #if
                              /usr/include/linux/jiffies.h: In function ‘usecs_to_jiffies’:
                              /usr/include/linux/jiffies.h:296: error: ‘CONFIG_HZ’ undeclared (first use in this function)
                              /usr/include/linux/jiffies.h: In function ‘timespec_to_jiffies’:
                              /usr/include/linux/jiffies.h:315: error: ‘CONFIG_HZ’ undeclared (first use in this function)
                              /usr/include/linux/jiffies.h:321: error: ‘SHIFT_HZ’ undeclared (first use in this function)
                              /usr/include/linux/jiffies.h: In function ‘jiffies_to_timespec’:
                              /usr/include/linux/jiffies.h:334: error: ‘CONFIG_HZ’ undeclared (first use in this function)
                              /usr/include/linux/jiffies.h: In function ‘timeval_to_jiffies’:
                              /usr/include/linux/jiffies.h:356: error: ‘CONFIG_HZ’ undeclared (first use in this function)
                              /usr/include/linux/jiffies.h:360: error: ‘SHIFT_HZ’ undeclared (first use in this function)
                              /usr/include/linux/jiffies.h: In function ‘jiffies_to_timeval’:
                              /usr/include/linux/jiffies.h:372: error: ‘CONFIG_HZ’ undeclared (first use in this function)
                              /usr/include/linux/jiffies.h:385:6: error: division by zero in #if
                              /usr/include/linux/jiffies.h:385:6: error: division by zero in #if
                              /usr/include/linux/jiffies.h:385:6: error: division by zero in #if
                              /usr/include/linux/jiffies.h:385:6: error: division by zero in #if
                              /usr/include/linux/jiffies.h:385:6: error: division by zero in #if
                              /usr/include/linux/jiffies.h:385:6: error: division by zero in #if
                              /usr/include/linux/jiffies.h:385:6: error: division by zero in #if
                              /usr/include/linux/jiffies.h:385:6: error: division by zero in #if
                              /usr/include/linux/jiffies.h:385:6: error: division by zero in #if
                              /usr/include/linux/jiffies.h:385:6: error: division by zero in #if
                              /usr/include/linux/jiffies.h:385:6: error: division by zero in #if
                              /usr/include/linux/jiffies.h:385:6: error: division by zero in #if
                              /usr/include/linux/jiffies.h:385:6: error: division by zero in #if
                              /usr/include/linux/jiffies.h:385:6: error: division by zero in #if
                              /usr/include/linux/jiffies.h:385:6: error: division by zero in #if
                              /usr/include/linux/jiffies.h:385:6: error: division by zero in #if
                              /usr/include/linux/jiffies.h: In function ‘jiffies_to_clock_t’:
                              /usr/include/linux/jiffies.h:386: error: ‘CONFIG_HZ’ undeclared (first use in this function)
                              /usr/include/linux/jiffies.h: In function ‘clock_t_to_jiffies’:
                              /usr/include/linux/jiffies.h:397: error: ‘CONFIG_HZ’ undeclared (first use in this function)
                              /usr/include/linux/jiffies.h:416:6: error: division by zero in #if
                              /usr/include/linux/jiffies.h:416:6: error: division by zero in #if
                              /usr/include/linux/jiffies.h:416:6: error: division by zero in #if
                              /usr/include/linux/jiffies.h:416:6: error: division by zero in #if
                              /usr/include/linux/jiffies.h:416:6: error: division by zero in #if
                              /usr/include/linux/jiffies.h:416:6: error: division by zero in #if
                              /usr/include/linux/jiffies.h:416:6: error: division by zero in #if
                              /usr/include/linux/jiffies.h:416:6: error: division by zero in #if
                              /usr/include/linux/jiffies.h:416:6: error: division by zero in #if
                              /usr/include/linux/jiffies.h:416:6: error: division by zero in #if
                              /usr/include/linux/jiffies.h:416:6: error: division by zero in #if
                              /usr/include/linux/jiffies.h:416:6: error: division by zero in #if
                              /usr/include/linux/jiffies.h:416:6: error: division by zero in #if
                              /usr/include/linux/jiffies.h:416:6: error: division by zero in #if
                              /usr/include/linux/jiffies.h:416:6: error: division by zero in #if
                              /usr/include/linux/jiffies.h:416:6: error: division by zero in #if
                              /usr/include/linux/jiffies.h: In function ‘jiffies_64_to_clock_t’:
                              /usr/include/linux/jiffies.h:417: error: ‘CONFIG_HZ’ undeclared (first use in this function)
                              In file included from /usr/include/linux/sched.h:16,
                                               from /usr/include/linux/mm.h:4,
                                               from /usr/include/linux/skbuff.h:26,
                                               from pcnet_cs.c:34:
                              /usr/include/linux/nodemask.h: At top level:
                              /usr/include/linux/nodemask.h:88: error: expected specifier-qualifier-list before ‘DECLARE_BITMAP’
                              /usr/include/linux/nodemask.h: In function ‘__node_set’:
                              /usr/include/linux/nodemask.h:94: error: ‘nodemask_t’ has no member named ‘bits’
                              /usr/include/linux/nodemask.h: In function ‘__node_clear’:
                              /usr/include/linux/nodemask.h:100: error: ‘nodemask_t’ has no member named ‘bits’
                              /usr/include/linux/nodemask.h: In function ‘__nodes_setall’:
                              /usr/include/linux/nodemask.h:106: error: ‘nodemask_t’ has no member named ‘bits’
                              /usr/include/linux/nodemask.h: In function ‘__nodes_clear’:
                              /usr/include/linux/nodemask.h:112: error: ‘nodemask_t’ has no member named ‘bits’
                              /usr/include/linux/nodemask.h: In function ‘__node_test_and_set’:
                              /usr/include/linux/nodemask.h:122: error: ‘nodemask_t’ has no member named ‘bits’
                              /usr/include/linux/nodemask.h: In function ‘__nodes_and’:
                              /usr/include/linux/nodemask.h:130: error: ‘nodemask_t’ has no member named ‘bits’
                              /usr/include/linux/nodemask.h:130: error: ‘nodemask_t’ has no member named ‘bits’
                              /usr/include/linux/nodemask.h:130: error: ‘nodemask_t’ has no member named ‘bits’
                              /usr/include/linux/nodemask.h: In function ‘__nodes_or’:
                              /usr/include/linux/nodemask.h:138: error: ‘nodemask_t’ has no member named ‘bits’
                              /usr/include/linux/nodemask.h:138: error: ‘nodemask_t’ has no member named ‘bits’
                              /usr/include/linux/nodemask.h:138: error: ‘nodemask_t’ has no member named ‘bits’
                              /usr/include/linux/nodemask.h: In function ‘__nodes_xor’:
                              /usr/include/linux/nodemask.h:146: error: ‘nodemask_t’ has no member named ‘bits’
                              /usr/include/linux/nodemask.h:146: error: ‘nodemask_t’ has no member named ‘bits’
                              /usr/include/linux/nodemask.h:146: error: ‘nodemask_t’ has no member named ‘bits’
                              /usr/include/linux/nodemask.h: In function ‘__nodes_andnot’:
                              /usr/include/linux/nodemask.h:154: error: ‘nodemask_t’ has no member named ‘bits’
                              /usr/include/linux/nodemask.h:154: error: ‘nodemask_t’ has no member named ‘bits’
                              /usr/include/linux/nodemask.h:154: error: ‘nodemask_t’ has no member named ‘bits’
                              /usr/include/linux/nodemask.h: In function ‘__nodes_complement’:
                              /usr/include/linux/nodemask.h:162: error: ‘nodemask_t’ has no member named ‘bits’
                              /usr/include/linux/nodemask.h:162: error: ‘nodemask_t’ has no member named ‘bits’
                              /usr/include/linux/nodemask.h: In function ‘__nodes_equal’:
                              /usr/include/linux/nodemask.h:170: error: ‘nodemask_t’ has no member named ‘bits’
                              /usr/include/linux/nodemask.h:170: error: ‘nodemask_t’ has no member named ‘bits’
                              /usr/include/linux/nodemask.h: In function ‘__nodes_intersects’:
                              /usr/include/linux/nodemask.h:178: error: ‘nodemask_t’ has no member named ‘bits’
                              /usr/include/linux/nodemask.h:178: error: ‘nodemask_t’ has no member named ‘bits’
                              /usr/include/linux/nodemask.h: In function ‘__nodes_subset’:
                              /usr/include/linux/nodemask.h:186: error: ‘nodemask_t’ has no member named ‘bits’
                              /usr/include/linux/nodemask.h:186: error: ‘nodemask_t’ has no member named ‘bits’
                              /usr/include/linux/nodemask.h: In function ‘__nodes_empty’:
                              /usr/include/linux/nodemask.h:192: error: ‘nodemask_t’ has no member named ‘bits’
                              /usr/include/linux/nodemask.h: In function ‘__nodes_full’:
                              /usr/include/linux/nodemask.h:198: error: ‘nodemask_t’ has no member named ‘bits’
                              /usr/include/linux/nodemask.h: In function ‘__nodes_weight’:
                              /usr/include/linux/nodemask.h:204: error: ‘nodemask_t’ has no member named ‘bits’
                              /usr/include/linux/nodemask.h: In function ‘__nodes_shift_right’:
                              /usr/include/linux/nodemask.h:212: error: ‘nodemask_t’ has no member named ‘bits’
                              /usr/include/linux/nodemask.h:212: error: ‘nodemask_t’ has no member named ‘bits’
                              /usr/include/linux/nodemask.h: In function ‘__nodes_shift_left’:
                              /usr/include/linux/nodemask.h:220: error: ‘nodemask_t’ has no member named ‘bits’
                              /usr/include/linux/nodemask.h:220: error: ‘nodemask_t’ has no member named ‘bits’
                              /usr/include/linux/nodemask.h: In function ‘__first_node’:
                              /usr/include/linux/nodemask.h:229: error: ‘nodemask_t’ has no member named ‘bits’
                              /usr/include/linux/nodemask.h: In function ‘__next_node’:
                              /usr/include/linux/nodemask.h:235: error: ‘nodemask_t’ has no member named ‘bits’
                              /usr/include/linux/nodemask.h: In function ‘__first_unset_node’:
                              /usr/include/linux/nodemask.h:253: error: ‘nodemask_t’ has no member named ‘bits’
                              /usr/include/linux/nodemask.h: In function ‘__nodemask_scnprintf’:
                              /usr/include/linux/nodemask.h:288: error: ‘nodemask_t’ has no member named ‘bits’
                              /usr/include/linux/nodemask.h: In function ‘__nodemask_parse’:
                              /usr/include/linux/nodemask.h:296: error: ‘nodemask_t’ has no member named ‘bits’
                              /usr/include/linux/nodemask.h: In function ‘__nodelist_scnprintf’:
                              /usr/include/linux/nodemask.h:304: error: ‘nodemask_t’ has no member named ‘bits’
                              /usr/include/linux/nodemask.h: In function ‘__nodelist_parse’:
                              /usr/include/linux/nodemask.h:310: error: ‘nodemask_t’ has no member named ‘bits’
                              /usr/include/linux/nodemask.h: In function ‘__node_remap’:
                              /usr/include/linux/nodemask.h:318: error: ‘nodemask_t’ has no member named ‘bits’
                              /usr/include/linux/nodemask.h:318: error: ‘nodemask_t’ has no member named ‘bits’
                              /usr/include/linux/nodemask.h: In function ‘__nodes_remap’:
                              /usr/include/linux/nodemask.h:326: error: ‘nodemask_t’ has no member named ‘bits’
                              /usr/include/linux/nodemask.h:326: error: ‘nodemask_t’ has no member named ‘bits’
                              /usr/include/linux/nodemask.h:326: error: ‘nodemask_t’ has no member named ‘bits’
                              /usr/include/linux/nodemask.h:326: error: ‘nodemask_t’ has no member named ‘bits’
                              In file included from /usr/include/linux/rwsem.h:27,
                                               from /usr/include/asm/semaphore.h:42,
                                               from /usr/include/linux/sched.h:19,
                                               from /usr/include/linux/mm.h:4,
                                               from /usr/include/linux/skbuff.h:26,
                                               from pcnet_cs.c:34:
                              /usr/include/asm/rwsem.h: In function ‘__down_read’:
                              /usr/include/asm/rwsem.h:105: error: expected ‘:’ or ‘)’ before ‘KBUILD_BASENAME’
                              /usr/include/asm/rwsem.h: In function ‘__down_write’:
                              /usr/include/asm/rwsem.h:157: error: expected ‘:’ or ‘)’ before ‘KBUILD_BASENAME’
                              /usr/include/asm/rwsem.h: In function ‘__up_read’:
                              /usr/include/asm/rwsem.h:194: error: expected ‘:’ or ‘)’ before ‘KBUILD_BASENAME’
                              /usr/include/asm/rwsem.h: In function ‘__up_write’:
                              /usr/include/asm/rwsem.h:220: error: expected ‘:’ or ‘)’ before ‘KBUILD_BASENAME’
                              /usr/include/asm/rwsem.h: In function ‘__downgrade_write’:
                              /usr/include/asm/rwsem.h:245: error: expected ‘:’ or ‘)’ before ‘KBUILD_BASENAME’
                              In file included from /usr/include/linux/sched.h:19,
                                               from /usr/include/linux/mm.h:4,
                                               from /usr/include/linux/skbuff.h:26,
                                               from pcnet_cs.c:34:
                              /usr/include/asm/semaphore.h: In function ‘down’:
                              /usr/include/asm/semaphore.h:105: error: expected ‘:’ or ‘)’ before ‘KBUILD_BASENAME’
                              /usr/include/asm/semaphore.h: In function ‘down_interruptible’:
                              /usr/include/asm/semaphore.h:130: error: expected ‘:’ or ‘)’ before ‘KBUILD_BASENAME’
                              /usr/include/asm/semaphore.h: In function ‘down_trylock’:
                              /usr/include/asm/semaphore.h:155: error: expected ‘:’ or ‘)’ before ‘KBUILD_BASENAME’
                              /usr/include/asm/semaphore.h: In function ‘up’:
                              /usr/include/asm/semaphore.h:179: error: expected ‘:’ or ‘)’ before ‘KBUILD_BASENAME’
                              In file included from /usr/include/asm/siginfo.h:4,
                                               from /usr/include/linux/signal.h:7,
                                               from /usr/include/linux/sched.h:27,
                                               from /usr/include/linux/mm.h:4,
                                               from /usr/include/linux/skbuff.h:26,
                                               from pcnet_cs.c:34:
                              /usr/include/asm-generic/siginfo.h: At top level:
                              /usr/include/asm-generic/siginfo.h:58: error: size of array ‘_pad’ is too large
                              In file included from /usr/include/linux/slab.h:99,
                                               from /usr/include/linux/percpu.h:5,
                                               from /usr/include/linux/rcupdate.h:41,
                                               from /usr/include/linux/pid.h:4,
                                               from /usr/include/linux/sched.h:32,
                                               from /usr/include/linux/mm.h:4,
                                               from /usr/include/linux/skbuff.h:26,
                                               from pcnet_cs.c:34:
                              /usr/include/linux/kmalloc_sizes.h:22:6: error: missing binary operator before token "("
                              In file included from /usr/include/linux/slab.h:124,
                                               from /usr/include/linux/percpu.h:5,
                                               from /usr/include/linux/rcupdate.h:41,
                                               from /usr/include/linux/pid.h:4,
                                               from /usr/include/linux/sched.h:32,
                                               from /usr/include/linux/mm.h:4,
                                               from /usr/include/linux/skbuff.h:26,
                                               from pcnet_cs.c:34:
                              /usr/include/linux/kmalloc_sizes.h:22:6: error: missing binary operator before token "("
                              In file included from /usr/include/linux/mm.h:4,
                                               from /usr/include/linux/skbuff.h:26,
                                               from pcnet_cs.c:34:
                              /usr/include/linux/sched.h:267:5: error: missing binary operator before token "("
                              In file included from /usr/include/linux/mm.h:4,
                                               from /usr/include/linux/skbuff.h:26,
                                               from pcnet_cs.c:34:
                              /usr/include/linux/sched.h: In function ‘set_cpus_allowed’:
                              /usr/include/linux/sched.h:992: error: ‘cpumask_t’ has no member named ‘bits’
                              /usr/include/linux/sched.h:992: error: ‘cpumask_t’ has no member named ‘bits’
                              In file included from /usr/include/asm/fixmap.h:27,
                                               from /usr/include/asm/pgtable.h:17,
                                               from /usr/include/linux/mm.h:38,
                                               from /usr/include/linux/skbuff.h:26,
                                               from pcnet_cs.c:34:
                              /usr/include/asm/acpi.h:31:28: error: acpi/pdc_intel.h: No such file or directory
                              In file included from /usr/include/linux/skbuff.h:26,
                                               from pcnet_cs.c:34:
                              /usr/include/linux/mm.h:247:5: error: missing binary operator before token "("
                              In file included from /usr/include/linux/skbuff.h:26,
                                               from pcnet_cs.c:34:
                              /usr/include/linux/mm.h: In function ‘lowmem_page_address’:
                              /usr/include/linux/mm.h:521: error: ‘CONFIG_PAGE_OFFSET’ undeclared (first use in this function)
                              /usr/include/linux/mm.h:820:5: error: missing binary operator before token "("
                              In file included from /usr/include/linux/module.h:22,
                                               from /usr/include/linux/textsearch.h:9,
                                               from /usr/include/linux/skbuff.h:30,
                                               from pcnet_cs.c:34:
                              /usr/include/asm/module.h:62:2: error: #error unknown processor family
                              In file included from pcnet_cs.c:34:
                              /usr/include/linux/skbuff.h:31:26: error: net/checksum.h: No such file or directory
                              In file included from pcnet_cs.c:36:
                              /usr/include/linux/modversions.h:1:2: error: #error "======================================================="
                              /usr/include/linux/modversions.h:2:2: error: #error "You should not include /usr/include/{linux,asm}/ header"
                              /usr/include/linux/modversions.h:3:2: error: #error "files directly for the compilation of kernel modules."
                              /usr/include/linux/modversions.h:4:2: error: #error ""
                              /usr/include/linux/modversions.h:5:2: error: #error "glibc now uses kernel header files from a well-defined"
                              /usr/include/linux/modversions.h:6:2: error: #error "working kernel version (as recommended by Linus Torvalds)"
                              /usr/include/linux/modversions.h:7:2: error: #error "These files are glibc internal and may not match the"
                              /usr/include/linux/modversions.h:8:2: error: #error "currently running kernel. They should only be"
                              /usr/include/linux/modversions.h:9:2: error: #error "included via other system header files - user space"
                              /usr/include/linux/modversions.h:10:2: error: #error "programs should not directly include <linux/*.h> or"
                              /usr/include/linux/modversions.h:11:2: error: #error "<asm/*.h> as well."
                              /usr/include/linux/modversions.h:12:2: error: #error ""
                              /usr/include/linux/modversions.h:13:2: error: #error "To build kernel modules please do the following:"
                              /usr/include/linux/modversions.h:14:2: error: #error ""
                              /usr/include/linux/modversions.h:15:2: error: #error " o Have the kernel sources installed"
                              /usr/include/linux/modversions.h:16:2: error: #error ""
                              /usr/include/linux/modversions.h:17:2: error: #error " o Make sure that the symbolic link"
                              /usr/include/linux/modversions.h:18:2: error: #error "   /lib/modules/`uname -r`/build exists and points to"
                              /usr/include/linux/modversions.h:19:2: error: #error "   the matching kernel source directory"
                              /usr/include/linux/modversions.h:20:2: error: #error ""
                              /usr/include/linux/modversions.h:21:2: error: #error " o Now copy /boot/vmlinuz.version.h to"
                              /usr/include/linux/modversions.h:22:2: error: #error "   /lib/modules/`uname -r`/build/include/linux/version.h"
                              /usr/include/linux/modversions.h:23:2: error: #error ""
                              /usr/include/linux/modversions.h:24:2: error: #error " o When compiling, make sure to use the following"
                              /usr/include/linux/modversions.h:25:2: error: #error "   compiler option to use the correct include files:"
                              /usr/include/linux/modversions.h:26:2: error: #error ""
                              /usr/include/linux/modversions.h:27:2: error: #error "   -I/lib/modules/`uname -r`/build/include"
                              /usr/include/linux/modversions.h:28:2: error: #error ""
                              /usr/include/linux/modversions.h:29:2: error: #error "   instead of"
                              /usr/include/linux/modversions.h:30:2: error: #error ""
                              /usr/include/linux/modversions.h:31:2: error: #error "   -I/usr/include/linux"
                              /usr/include/linux/modversions.h:32:2: error: #error ""
                              /usr/include/linux/modversions.h:33:2: error: #error "   Please adjust the Makefile accordingly."
                              /usr/include/linux/modversions.h:34:2: error: #error "======================================================="
                              pcnet_cs.c:41:26: error: linux/malloc.h: No such file or directory
                              In file included from pcnet_cs.c:45:
                              /usr/include/asm/io.h: In function ‘virt_to_phys’:
                              /usr/include/asm/io.h:78: error: ‘CONFIG_PAGE_OFFSET’ undeclared (first use in this function)
                              /usr/include/asm/io.h: In function ‘phys_to_virt’:
                              /usr/include/asm/io.h:96: error: ‘CONFIG_PAGE_OFFSET’ undeclared (first use in this function)
                              In file included from /usr/include/linux/irq.h:22,
                                               from /usr/include/asm/hardirq.h:6,
                                               from /usr/include/linux/hardirq.h:7,
                                               from /usr/include/linux/interrupt.h:11,
                                               from /usr/include/linux/netdevice.h:553,
                                               from pcnet_cs.c:48:
                              /usr/include/asm/irq.h:16:25: error: irq_vectors.h: No such file or directory
                              In file included from /usr/include/asm/hardirq.h:6,
                                               from /usr/include/linux/hardirq.h:7,
                                               from /usr/include/linux/interrupt.h:11,
                                               from /usr/include/linux/netdevice.h:553,
                                               from pcnet_cs.c:48:
                              /usr/include/linux/irq.h: At top level:
                              /usr/include/linux/irq.h:83: error: requested alignment is not a constant
                              /usr/include/linux/irq.h:85: error: ‘NR_IRQS’ undeclared here (not in a function)
                              In file included from /usr/include/linux/irq.h:94,
                                               from /usr/include/asm/hardirq.h:6,
                                               from /usr/include/linux/hardirq.h:7,
                                               from /usr/include/linux/interrupt.h:11,
                                               from /usr/include/linux/netdevice.h:553,
                                               from pcnet_cs.c:48:
                              /usr/include/asm/hw_irq.h:30: error: ‘NR_IRQ_VECTORS’ undeclared here (not in a function)
                              In file included from /usr/include/linux/hardirq.h:7,
                                               from /usr/include/linux/interrupt.h:11,
                                               from /usr/include/linux/netdevice.h:553,
                                               from pcnet_cs.c:48:
                              /usr/include/asm/hardirq.h:13: error: requested alignment is not a constant
                              pcnet_cs.c:49:30: error: drivers/net/8390.h: No such file or directory
                              pcnet_cs.c:52:29: error: pcmcia/k_compat.h: No such file or directory
                              pcnet_cs.c:53:32: error: pcmcia/driver_ops.h: No such file or directory
                              pcnet_cs.c:54:28: error: pcmcia/version.h: No such file or directory
                              pcnet_cs.c:55:29: error: pcmcia/cs_types.h: No such file or directory
                              pcnet_cs.c:56:23: error: pcmcia/cs.h: No such file or directory
                              pcnet_cs.c:57:27: error: pcmcia/cistpl.h: No such file or directory
                              pcnet_cs.c:58:28: error: pcmcia/ciscode.h: No such file or directory
                              pcnet_cs.c:59:23: error: pcmcia/ds.h: No such file or directory
                              pcnet_cs.c:60:27: error: pcmcia/cisreg.h: No such file or directory
                              pcnet_cs.c:122: error: expected ‘)’ before string constant
                              pcnet_cs.c:123: error: expected ‘)’ before string constant
                              pcnet_cs.c:124: error: expected ‘)’ before string constant
                              pcnet_cs.c:125: error: expected ‘)’ before string constant
                              pcnet_cs.c:126: error: expected ‘)’ before string constant
                              pcnet_cs.c:127: error: expected ‘)’ before string constant
                              pcnet_cs.c:128: error: expected ‘)’ before string constant
                              pcnet_cs.c:129: error: expected ‘)’ before string constant
                              pcnet_cs.c:130: error: expected ‘)’ before string constant
                              pcnet_cs.c:132: error: expected ‘)’ before ‘*’ token
                              pcnet_cs.c:134: error: expected ‘)’ before ‘event’
                              pcnet_cs.c:144: error: expected ‘)’ before ‘*’ token
                              pcnet_cs.c:146: error: expected ‘)’ before ‘*’ token
                              pcnet_cs.c:149: error: expected ‘=’, ‘,’, ‘;’, ‘asm’ or ‘__attribute__’ before ‘dev_info’
                              pcnet_cs.c:151: error: expected ‘=’, ‘,’, ‘;’, ‘asm’ or ‘__attribute__’ before ‘*’ token
                              pcnet_cs.c:152: error: expected ‘)’ before ‘*’ token
                              pcnet_cs.c:154: error: expected ‘=’, ‘,’, ‘;’, ‘asm’ or ‘__attribute__’ before ‘*’ token
                              pcnet_cs.c:237: error: expected specifier-qualifier-list before ‘dev_node_t’
                              pcnet_cs.c:243: error: expected ‘=’, ‘,’, ‘;’, ‘asm’ or ‘__attribute__’ before ‘*’ token
                              pcnet_cs.c:246: error: expected ‘)’ before ‘handle’
                              pcnet_cs.c:264: error: expected ‘=’, ‘,’, ‘;’, ‘asm’ or ‘__attribute__’ before ‘*’ token
                              pcnet_cs.c:335: error: expected ‘)’ before ‘*’ token
                              pcnet_cs.c:388: error: expected ‘)’ before ‘*’ token
                              pcnet_cs.c:409: error: expected ‘)’ before ‘*’ token
                              pcnet_cs.c:474: error: expected ‘)’ before ‘*’ token
                              pcnet_cs.c:536: error: expected ‘)’ before ‘*’ token
                              pcnet_cs.c:558: error: expected ‘)’ before ‘*’ token
                              pcnet_cs.c:589: error: expected ‘)’ before ‘*’ token
                              pcnet_cs.c: In function ‘pcnet_release’:
                              pcnet_cs.c:838: error: ‘dev_link_t’ undeclared (first use in this function)
                              pcnet_cs.c:838: error: ‘link’ undeclared (first use in this function)
                              pcnet_cs.c:838: error: expected expression before ‘)’ token
                              pcnet_cs.c:847: error: ‘DEV_STALE_CONFIG’ undeclared (first use in this function)
                              pcnet_cs.c:852: error: ‘pcnet_dev_t’ has no member named ‘flags’
                              pcnet_cs.c:853: error: ‘pcnet_dev_t’ has no member named ‘base’
                              pcnet_cs.c:854: error: ‘ReleaseWindow’ undeclared (first use in this function)
                              pcnet_cs.c:857: error: ‘ReleaseConfiguration’ undeclared (first use in this function)
                              pcnet_cs.c:858: error: ‘ReleaseIO’ undeclared (first use in this function)
                              pcnet_cs.c:859: error: ‘ReleaseIRQ’ undeclared (first use in this function)
                              pcnet_cs.c:862: warning: passing argument 1 of ‘unregister_netdev’ from incompatible pointer type
                              pcnet_cs.c:866: error: ‘DEV_CONFIG’ undeclared (first use in this function)
                              pcnet_cs.c:866: error: ‘DEV_RELEASE_PENDING’ undeclared (first use in this function)
                              pcnet_cs.c:867: error: ‘DEV_STALE_LINK’ undeclared (first use in this function)
                              pcnet_cs.c: At top level:
                              pcnet_cs.c:878: error: expected ‘)’ before ‘event’
                              pcnet_cs.c: In function ‘set_misc_reg’:
                              pcnet_cs.c:940: error: ‘struct device’ has no member named ‘base_addr’
                              pcnet_cs.c:944: error: ‘pcnet_dev_t’ has no member named ‘flags’
                              pcnet_cs.c:946: error: ‘struct device’ has no member named ‘if_port’
                              pcnet_cs.c:949: error: ‘pcnet_dev_t’ has no member named ‘flags’
                              pcnet_cs.c:952: error: ‘pcnet_dev_t’ has no member named ‘flags’
                              pcnet_cs.c: In function ‘pcnet_open’:
                              pcnet_cs.c:961: error: ‘dev_link_t’ undeclared (first use in this function)
                              pcnet_cs.c:961: error: ‘link’ undeclared (first use in this function)
                              pcnet_cs.c:965: error: ‘dev_list’ undeclared (first use in this function)
                              pcnet_cs.c:974: error: ‘MOD_INC_USE_COUNT’ undeclared (first use in this function)
                              pcnet_cs.c:977: error: ‘pcnet_dev_t’ has no member named ‘flags’
                              pcnet_cs.c:981: error: ‘struct device’ has no member named ‘base_addr’
                              pcnet_cs.c:985: error: ‘CONFIG_HZ’ undeclared (first use in this function)
                              pcnet_cs.c:990: error: ‘struct device’ has no member named ‘irq’
                              pcnet_cs.c:990: error: ‘ei_interrupt’ undeclared (first use in this function)
                              pcnet_cs.c:990: error: ‘dev_info’ undeclared (first use in this function)
                              pcnet_cs.c: In function ‘pcnet_close’:
                              pcnet_cs.c:996: error: ‘dev_link_t’ undeclared (first use in this function)
                              pcnet_cs.c:996: error: ‘link’ undeclared (first use in this function)
                              pcnet_cs.c:1000: error: ‘dev_list’ undeclared (first use in this function)
                              pcnet_cs.c:1007: error: ‘struct device’ has no member named ‘irq’
                              pcnet_cs.c:1008: error: ‘struct device’ has no member named ‘start’
                              pcnet_cs.c:1009: error: ‘DEV_STALE_CONFIG’ undeclared (first use in this function)
                              pcnet_cs.c:1010: error: ‘CONFIG_HZ’ undeclared (first use in this function)
                              pcnet_cs.c:1011: error: ‘DEV_RELEASE_PENDING’ undeclared (first use in this function)
                              pcnet_cs.c:1015: error: ‘MOD_DEC_USE_COUNT’ undeclared (first use in this function)
                              pcnet_cs.c: In function ‘pcnet_reset_8390’:
                              pcnet_cs.c:1025: error: ‘struct device’ has no member named ‘base_addr’
                              pcnet_cs.c:1028: error: ‘ei_status’ undeclared (first use in this function)
                              pcnet_cs.c:1040: error: ‘EN0_ISR’ undeclared (first use in this function)
                              pcnet_cs.c:1040: error: ‘ENISR_RESET’ undeclared (first use in this function)
                              pcnet_cs.c:1050: error: ‘struct device’ has no member named ‘name’
                              pcnet_cs.c: In function ‘set_config’:
                              pcnet_cs.c:1058: error: ‘struct device’ has no member named ‘if_port’
                              pcnet_cs.c:1059: error: ‘pcnet_dev_t’ has no member named ‘flags’
                              pcnet_cs.c:1061: error: ‘struct device’ has no member named ‘name’
                              pcnet_cs.c:1066: error: ‘struct device’ has no member named ‘if_port’
                              pcnet_cs.c:1067: error: ‘struct device’ has no member named ‘name’
                              pcnet_cs.c:1068: error: ‘struct device’ has no member named ‘if_port’
                              pcnet_cs.c: At top level:
                              pcnet_cs.c:1077: warning: ‘struct e8390_pkt_hdr’ declared inside parameter list
                              pcnet_cs.c:1077: warning: its scope is only this definition or declaration, which is probably not what you want
                              pcnet_cs.c: In function ‘dma_get_8390_hdr’:
                              pcnet_cs.c:1078: error: ‘struct device’ has no member named ‘base_addr’
                              pcnet_cs.c:1080: error: ‘EN0_RSARLO’ undeclared (first use in this function)
                              pcnet_cs.c:1081: error: ‘EN0_RSARHI’ undeclared (first use in this function)
                              pcnet_cs.c:1082: error: ‘E8390_RREAD’ undeclared (first use in this function)
                              pcnet_cs.c:1082: error: ‘E8390_START’ undeclared (first use in this function)
                              pcnet_cs.c:1084: error: invalid application of ‘sizeof’ to incomplete type ‘struct e8390_pkt_hdr’
                              pcnet_cs.c: In function ‘dma_block_input’:
                              pcnet_cs.c:1089: error: ‘struct device’ has no member named ‘base_addr’
                              pcnet_cs.c:1098: error: ‘EN0_RSARLO’ undeclared (first use in this function)
                              pcnet_cs.c:1099: error: ‘EN0_RSARHI’ undeclared (first use in this function)
                              pcnet_cs.c:1100: error: ‘E8390_RREAD’ undeclared (first use in this function)
                              pcnet_cs.c:1100: error: ‘E8390_START’ undeclared (first use in this function)
                              pcnet_cs.c: In function ‘dma_block_output’:
                              pcnet_cs.c:1134: error: ‘struct device’ has no member named ‘base_addr’
                              pcnet_cs.c:1156: warning: ‘save_flags’ is deprecated (declared at /usr/include/linux/interrupt.h:85)
                              pcnet_cs.c:1157: warning: ‘cli’ is deprecated (declared at /usr/include/linux/interrupt.h:77)
                              pcnet_cs.c:1163: error: ‘EN0_RSARLO’ undeclared (first use in this function)
                              pcnet_cs.c:1164: error: ‘EN0_RSARHI’ undeclared (first use in this function)
                              pcnet_cs.c:1165: error: ‘E8390_RWRITE’ undeclared (first use in this function)
                              pcnet_cs.c:1165: error: ‘E8390_START’ undeclared (first use in this function)
                              pcnet_cs.c:1196: warning: ‘restore_flags’ is deprecated (declared at /usr/include/linux/interrupt.h:90)
                              pcnet_cs.c: At top level:
                              pcnet_cs.c:1199: error: expected ‘)’ before ‘*’ token
                              pcnet_cs.c:1257: warning: ‘struct e8390_pkt_hdr’ declared inside parameter list
                              pcnet_cs.c: In function ‘shmem_get_8390_hdr’:
                              pcnet_cs.c:1258: error: ‘struct device’ has no member named ‘rmem_start’
                              pcnet_cs.c:1259: error: ‘ei_status’ undeclared (first use in this function)
                              pcnet_cs.c:1261: error: invalid application of ‘sizeof’ to incomplete type ‘struct e8390_pkt_hdr’
                              pcnet_cs.c: In function ‘shmem_block_input’:
                              pcnet_cs.c:1266: error: ‘struct device’ has no member named ‘rmem_start’
                              pcnet_cs.c:1267: error: ‘ei_status’ undeclared (first use in this function)
                              pcnet_cs.c:1270: error: ‘struct device’ has no member named ‘rmem_end’
                              pcnet_cs.c:1272: error: ‘struct device’ has no member named ‘rmem_end’
                              pcnet_cs.c:1276: error: ‘struct device’ has no member named ‘rmem_start’
                              pcnet_cs.c: In function ‘shmem_block_output’:
                              pcnet_cs.c:1285: error: ‘struct device’ has no member named ‘mem_start’
                              pcnet_cs.c:1286: error: ‘ei_status’ undeclared (first use in this function)
                              pcnet_cs.c:1288: error: ‘ei_debug’ undeclared (first use in this function)
                              pcnet_cs.c: At top level:
                              pcnet_cs.c:1294: error: expected ‘)’ before ‘*’ token
                              pcnet_cs.c: In function ‘init_module’:
                              pcnet_cs.c:1350: error: ‘servinfo_t’ undeclared (first use in this function)
                              pcnet_cs.c:1350: error: expected ‘;’ before ‘serv’
                              pcnet_cs.c:1352: error: ‘GetCardServicesInfo’ undeclared (first use in this function)
                              pcnet_cs.c:1352: error: ‘serv’ undeclared (first use in this function)
                              pcnet_cs.c:1353: error: ‘CS_RELEASE_CODE’ undeclared (first use in this function)
                              pcnet_cs.c:1360: error: ‘dev_info’ undeclared (first use in this function)
                              pcnet_cs.c:1360: error: ‘pcnet_attach’ undeclared (first use in this function)
                              pcnet_cs.c:1360: error: ‘pcnet_detach’ undeclared (first use in this function)
                              pcnet_cs.c: In function ‘cleanup_module’:
                              pcnet_cs.c:1371: error: ‘dev_info’ undeclared (first use in this function)
                              pcnet_cs.c:1372: error: ‘dev_list’ undeclared (first use in this function)
                              make: *** [_pcnet_cs.o] Error 1
                              [[email protected]t pcmcia-klm5620-l-v1.0]#
                              وظهرت النتيجة نفسها بالأمر make install

                              وأيضا نفس الشيء عندما دخلت من خلال الرووت وليس مستخدمي
                              يعني عندما كان ظاهر لدي كالتالي

                              كود:
                               [[email protected] pcmcia-klm5620-l-v1.0]$

                              تعليق

                              يعمل...
                              X